# Parse error in parsedate.y

- Thread: https://externals.io/message/8301
- Original archive: https://news-web.php.net/php.internals/8301
- Started by Jan Schneider on 2004-03-02T11:25:38+00:00
- Messages: 6
- Reply by email to internals@lists.php.net
- More for agents: search with https://externals.io/search.md?q={query} · JSON API at https://externals.io/api · documentation at https://externals.io/llms.txt

---

## #8301 — Jan Schneider — 2004-03-02T11:25:38+00:00

URL: https://externals.io/message/8301#8301

bison -y /home/jan/cvs/php5/ext/standard/parsedate.y -o
/home/jan/cvs/php5/ext/standard/parsedate.c
/home/jan/cvs/php5/ext/standard/parsedate.y:389.12: parse error, unexpected
":", expecting ";" or "|"
make: *** [/home/jan/cvs/php5/ext/standard/parsedate.c] Fehler 1

Jan.

--
http://www.horde.org - The Horde Project
http://www.ammma.de - Neue Wege des Lernens
http://www.tip4all.de - Deine private Tippgemeinschaft

---

## #8302 — Jan Lehnardt — 2004-03-02T11:41:17+00:00

URL: https://externals.io/message/8301#8302 · In reply to: #8301

Hi Jan,


> bison -y /home/jan/cvs/php5/ext/standard/parsedate.y -o
> /home/jan/cvs/php5/ext/standard/parsedate.c
> /home/jan/cvs/php5/ext/standard/parsedate.y:389.12: parse error, 
> unexpected
> ":", expecting ";" or "|"
> make: *** [/home/jan/cvs/php5/ext/standard/parsedate.c] Fehler 1

Which version of bison are you running? 1.28 works fine here.

Jan

---

## #8304 — Edin Kadribasic — 2004-03-02T13:01:32+00:00

URL: https://externals.io/message/8301#8304 · In reply to: #8302

Same problem on win32 snap box which used to work fine. bison version is
1.75.

Edin

----- Original Message ----- 
From: "Jan Lehnardt" <jan@php.net>
To: "Jan Schneider" <jan@horde.org>
Cc: <internals@lists.php.net>
Sent: Tuesday, March 02, 2004 12:41 PM
Subject: Re: [PHP-DEV] Parse error in parsedate.y


Hi Jan,


> bison -y /home/jan/cvs/php5/ext/standard/parsedate.y -o
> /home/jan/cvs/php5/ext/standard/parsedate.c
> /home/jan/cvs/php5/ext/standard/parsedate.y:389.12: parse error,
> unexpected
> ":", expecting ";" or "|"
> make: *** [/home/jan/cvs/php5/ext/standard/parsedate.c] Fehler 1

Which version of bison are you running? 1.28 works fine here.

Jan

---

## #8305 — Jan Schneider — 2004-03-02T13:13:12+00:00

URL: https://externals.io/message/8301#8305 · In reply to: #8302

Zitat von Jan Lehnardt <jan@php.net>:

> Hi Jan,
> 
>
> > […]
>
> Which version of bison are you running? 1.28 works fine here.

1.75

Jan.

--
http://www.horde.org - The Horde Project
http://www.ammma.de - Neue Wege des Lernens
http://www.tip4all.de - Deine private Tippgemeinschaft

---

## #8306 — Derick Rethans — 2004-03-02T13:18:19+00:00

URL: https://externals.io/message/8301#8306 · In reply to: #8304

> Same problem on win32 snap box which used to work fine. bison version is
> 1.75.

Should be fixed in CVS now.

Derick

---

## #8308 — Jan Schneider — 2004-03-02T15:38:47+00:00

URL: https://externals.io/message/8301#8308 · In reply to: #8306

Zitat von Derick Rethans <derick@php.net>:

> 
>
> > […]
>
> Should be fixed in CVS now.

Yeah, works again, thanks.

Jan.

--
http://www.horde.org - The Horde Project
http://www.ammma.de - Neue Wege des Lernens
http://www.tip4all.de - Deine private Tippgemeinschaft
